Target
Toll-like receptor 7
Ligand
BDBM50340234
Substrate
Meas. Tech.
ChEMBL_741445 (CHEMBL1763704)
EC50
269±n/a nM
Citation
 Tran, TDPryde, DCJones, PAdam, FMBenson, NBish, GCalo, FCiaramella, GDixon, RDuckworth, JFox, DNHay, DAHitchin, JHorscroft, NHoward, MGardner, IJones, HMLaxton, CParkinson, TParsons, GProctor, KSmith, MCSmith, NThomas, A Design and optimisation of orally active TLR7 agonists for the treatment of hepatitis C virus infection. Bioorg Med Chem Lett 21:2389-93 (2011)  
Target
Name:
Toll-like receptor 7
Synonyms:
ORF Names:UNQ248/PRO285 TLR7_HUMAN | Toll-like receptor 7 (TLR7)
Type:
Enzyme
Mol. Mass.:
120945.35
Organism:
Homo sapiens (Human)
Description:
Q9NYK1
Residue:
1049
  
Inhibitor
Name:
BDBM50340234
Synonyms:
4-amino-1-benzyl-6-(trifluoromethyl)-1H-imidazo[4,5-c]pyridin-2(3H)-one | CHEMBL1760434
Type:
Small organic molecule
Emp. Form.:
C14H11F3N4O
Mol. Mass.:
308.2585
SMILES:
Nc1nc(cc2n(Cc3ccccc3)c(=O)[nH]c12)C(F)(F)F
: