Target
RAF proto-oncogene serine/threonine-protein kinase
Ligand
BDBM50340270
Substrate
Meas. Tech.
ChEMBL_741467 (CHEMBL1763782)
IC50
170±n/a nM
Citation
 Buchstaller, HPBurgdorf, LFinsinger, DStieber, FSirrenberg, CAmendt, CGrell, MZenke, FKrier, M Design and synthesis of isoquinolines and benzimidazoles as RAF kinase inhibitors. Bioorg Med Chem Lett 21:2264-9 (2011)  
Target
Name:
RAF proto-oncogene serine/threonine-protein kinase
Synonyms:
C-Raf Protein Kinase RAF RAF1 Raf-1 Serine/threonine-protein kinase C-Raf | cRaf
Type:
Serine/threonine-protein kinase
Mol. Mass.:
73082.52
Organism:
Homo sapiens (Human)
Description:
P04049
Residue:
648
  
Inhibitor
Name:
BDBM50340270
Synonyms:
CHEMBL1760630 | N-(6-(2-(3-(2-methoxy-5-(trifluoromethyl)phenyl)ureido)ethyl)-1H-benzo[d]imidazol-2-yl)acetamide
Type:
Small organic molecule
Emp. Form.:
C20H20F3N5O3
Mol. Mass.:
435.3997
SMILES:
COc1ccc(cc1NC(=O)NCCc1ccc2nc(NC(C)=O)[nH]c2c1)C(F)(F)F
: