Target
11-beta-hydroxysteroid dehydrogenase 1
Ligand
BDBM50340383
Substrate
Meas. Tech.
ChEMBL_740937 (CHEMBL1764081)
IC50
19±n/a nM
Citation
 Maletic, MLeeman, ASzymonifka, MMundt, SSZokian, HJShah, KDragovic, JLyons, KThieringer, RVosatka, AHBalkovec, JWaddell, ST Bicyclo[2.2.2]octyltriazole inhibitors of 11β-hydoxysteroid dehydrogenase type 1. Pharmacological agents for the treatment of metabolic syndrome. Bioorg Med Chem Lett 21:2568-72 (2011)  
Target
Name:
11-beta-hydroxysteroid dehydrogenase 1
Synonyms:
11-DH 11-beta-Hydroxysteroid Dehydrogenase 1 (11-beta-HSD1) 11beta-HSD1A Corticosteroid 11-beta-dehydrogenase isozyme 1 (11-beta-HSD-1) Hsd11 | Hsd11b1
Type:
Enzyme
Mol. Mass.:
32369.70
Organism:
Mus musculus (mouse)
Description:
P50172
Residue:
292
  
Inhibitor
Name:
BDBM50340383
Synonyms:
5-(4-(5,6,7,8,9,10-hexahydro-[1,2,4]triazolo[4,3-a]azocin-3-yl)bicyclo[2.2.2]octan-1-yl)pentan-2-ol | CHEMBL1761135
Type:
Small organic molecule
Emp. Form.:
C21H35N3O
Mol. Mass.:
345.5221
SMILES:
CC(O)CCCC12CCC(CC1)(CC2)c1nnc2CCCCCCn12
: