Target
Transcription factor Jun
Ligand
BDBM50340600
Substrate
Meas. Tech.
ChEMBL_739507 (CHEMBL1763333)
IC50
120±n/a nM
Citation
 He, YKamenecka, TMShin, YSong, XJiang, RNoel, RDuckett, DChen, WLing, YYCameron, MDLin, LKhan, SKoenig, MLoGrasso, PV Synthesis and SAR of novel quinazolines as potent and brain-penetrant c-jun N-terminal kinase (JNK) inhibitors. Bioorg Med Chem Lett 21:1719-23 (2011)  
Target
Name:
Transcription factor Jun
Synonyms:
AP1 JUN Proto-oncogene c-JUN Transcription factor AP1 p39
Type:
Mol. Mass.:
35683.24
Organism:
Homo sapiens (Human)
Description:
P05412
Residue:
331
  
Inhibitor
Name:
BDBM50340600
Synonyms:
CHEMBL1761555 | N-(4-(3-morpholino-1H-1,2,4-triazol-1-yl)phenyl)-7-(1H-pyrazol-4-yl)quinazolin-2-amine
Type:
Small organic molecule
Emp. Form.:
C23H21N9O
Mol. Mass.:
439.4725
SMILES:
C1CN(CCO1)c1ncn(n1)-c1ccc(Nc2ncc3ccc(cc3n2)-c2cn[nH]c2)cc1
: