Target
Transcription factor Jun
Ligand
BDBM50340609
Substrate
Meas. Tech.
ChEMBL_739507 (CHEMBL1763333)
IC50
330±n/a nM
Citation
 He, YKamenecka, TMShin, YSong, XJiang, RNoel, RDuckett, DChen, WLing, YYCameron, MDLin, LKhan, SKoenig, MLoGrasso, PV Synthesis and SAR of novel quinazolines as potent and brain-penetrant c-jun N-terminal kinase (JNK) inhibitors. Bioorg Med Chem Lett 21:1719-23 (2011)  
Target
Name:
Transcription factor Jun
Synonyms:
AP1 JUN Proto-oncogene c-JUN Transcription factor AP1 p39
Type:
Mol. Mass.:
35683.24
Organism:
Homo sapiens (Human)
Description:
P05412
Residue:
331
  
Inhibitor
Name:
BDBM50340609
Synonyms:
8-(1-methyl-1H-pyrazol-4-yl)-N-(4-(3-morpholino-1H-1,2,4-triazol-1-yl)phenyl)quinazolin-2-amine | CHEMBL1761564
Type:
Small organic molecule
Emp. Form.:
C24H23N9O
Mol. Mass.:
453.4991
SMILES:
Cn1cc(cn1)-c1cccc2cnc(Nc3ccc(cc3)-n3cnc(n3)N3CCOCC3)nc12
: