Target
Mitogen-activated protein kinase kinase kinase 7/TGF-beta-activated kinase 1 and MAP3K7-binding protein 1
Ligand
BDBM50191785
Substrate
Meas. Tech.
ChEBML_739577
IC50
46±n/a nM
Citation
 Lockman, JWReeder, MDRobinson, ROrmonde, PACimbora, DMWilliams, BLWillardsen, JA Oxindole derivatives as inhibitors of TAK1 kinase. Bioorg Med Chem Lett 21:1724-7 (2011)  
Target
Name:
Mitogen-activated protein kinase kinase kinase 7/TGF-beta-activated kinase 1 and MAP3K7-binding protein 1
Synonyms:
Mitogen-activated protein kinase kinase kinase 7 interacting protein 1 TAK1/TAB1
Type:
Mol. Mass.:
Description:
ASSAY_ID of EBI is 739577
Components:
This complex has 2 components.
Component 1
Name:
TGF-beta-activated kinase 1 and MAP3K7-binding protein 1
Synonyms:
MAP3K7IP1 TAB1 TAK1-binding protein 1 | TGF-beta-activated kinase 1-binding protein1
Type:
Enzyme
Mol. Mass.:
54633.89
Organism:
Homo sapiens (Human)
Description:
Q15750
Residue:
504
  
Component 2
Name:
Mitogen-activated protein kinase kinase kinase 7
Synonyms:
M3K7_HUMAN Mitogen-activated protein kinase kinase kinase 7 TAK1/TAB1 Transforming growth factor-beta-activated kinase 1 (TAK1)
Type:
Protein
Mol. Mass.:
67199.89
Organism:
Homo sapiens (Human)
Description:
O43318
Residue:
606
  
Inhibitor
Name:
BDBM50191785
Synonyms:
CHEMBL1761585
Type:
Small organic molecule
Emp. Form.:
C17H12N4O3S
Mol. Mass.:
352.367
SMILES:
Oc1ccc(cc1)N1C(=O)CS\C1=N/N=C1\C(=O)Nc2ccccc12
: