Target
Androgen receptor
Ligand
BDBM50340663
Substrate
Meas. Tech.
ChEMBL_739810 (CHEMBL1762870)
Ki
1500±n/a nM
Citation
 Hudson, ARHiguchi, RIRoach, SLValdez, LJAdams, MEVassar, ARungta, DSyka, PMMais, DEMarschke, KBZhi, L Nonsteroidal 2,3-dihydroquinoline glucocorticoid receptor agonists with reduced PEPCK activation. Bioorg Med Chem Lett 21:1654-7 (2011)  
Target
Name:
Androgen receptor
Synonyms:
ANDR_HUMAN Androgen Receptor Androgen receptor/Baculoviral IAP repeat-containing protein 2 Dihydrotestosterone receptor Nuclear receptor subfamily 3 group C member 4
Type:
Receptor
Mol. Mass.:
99185.27
Organism:
Homo sapiens (Human)
Description:
CHO cells were stably transfected with human AR gene.
Residue:
920
  
Inhibitor
Name:
BDBM50340663
Synonyms:
5,7-difluoro-2,2-dimethyl-6-(3-methyl-1H-indol-7-yl)-2,3-dihydroquinolin-4(1H)-one O-isopropyl oxime | CHEMBL1762204
Type:
Small organic molecule
Emp. Form.:
C23H25F2N3O
Mol. Mass.:
397.4609
SMILES:
CC(C)O\N=C1/CC(C)(C)Nc2cc(F)c(c(F)c12)-c1cccc2c(C)c[nH]c12
: