Target
Glucocorticoid receptor
Ligand
BDBM50340663
Substrate
Meas. Tech.
ChEMBL_739896 (CHEMBL1762956)
EC50
250±n/a nM
Citation
 Hudson, ARHiguchi, RIRoach, SLValdez, LJAdams, MEVassar, ARungta, DSyka, PMMais, DEMarschke, KBZhi, L Nonsteroidal 2,3-dihydroquinoline glucocorticoid receptor agonists with reduced PEPCK activation. Bioorg Med Chem Lett 21:1654-7 (2011)  
Target
Name:
Glucocorticoid receptor
Synonyms:
GCR_HUMAN GRL Glucocorticoid receptor (GRFP) Nuclear receptor subfamily 3 group C member 1
Type:
Enzyme
Mol. Mass.:
85656.87
Organism:
Homo sapiens (Human)
Description:
P04150
Residue:
777
  
Inhibitor
Name:
BDBM50340663
Synonyms:
5,7-difluoro-2,2-dimethyl-6-(3-methyl-1H-indol-7-yl)-2,3-dihydroquinolin-4(1H)-one O-isopropyl oxime | CHEMBL1762204
Type:
Small organic molecule
Emp. Form.:
C23H25F2N3O
Mol. Mass.:
397.4609
SMILES:
CC(C)O\N=C1/CC(C)(C)Nc2cc(F)c(c(F)c12)-c1cccc2c(C)c[nH]c12
: