Target
5-hydroxytryptamine receptor 6
Ligand
BDBM50340725
Substrate
Meas. Tech.
ChEMBL_740243 (CHEMBL1764143)
Ki
0.2±n/a nM
Citation
 Ivachtchenko, AVGolovina, ESKadieva, MGKoryakova, AGMitkin, ODTkachenko, SEKysil, VMOkun, I 2-Substituted 5,6-dimethyl-3-phenylsulfonyl-pyrazolo[1,5-a]pyrimidines: new series of highly potent and specific serotonin 5-HT6 receptor antagonists. Eur J Med Chem 46:1189-97 (2011)  
Target
Name:
5-hydroxytryptamine receptor 6
Synonyms:
5-HT-6 5-hydroxytryptamine receptor 6 (5-HT-6) 5-hydroxytryptamine receptor 6 (5HT6) HTR6 Serotonin 6 (5-HT6) receptor | Serotonin Receptor 6
Type:
G Protein-Coupled Receptor (GPCR)
Mol. Mass.:
46968.43
Organism:
Homo sapiens (Human)
Description:
P50406
Residue:
440
  
Inhibitor
Name:
BDBM50340725
Synonyms:
CHEMBL1668584 US8829009, 1.1(1)
Type:
Small organic molecule
Emp. Form.:
C15H16N4O2S
Mol. Mass.:
316.378
SMILES:
CNc1nn2c(C)cc(C)nc2c1S(=O)(=O)c1ccccc1
: