Target
Lethal factor
Ligand
BDBM50340755
Substrate
Meas. Tech.
ChEMBL_740261 (CHEMBL1764161)
Ki
0.25±n/a nM
Citation
 Kim, SJiao, GSMoayeri, MCrown, DCregar-Hernandez, LMcKasson, LMargosiak, SALeppla, SHJohnson, AT Antidotes to anthrax lethal factor intoxication. Part 2: structural modifications leading to improved in vivo efficacy. Bioorg Med Chem Lett 21:2030-3 (2011)  
Target
Name:
Lethal factor
Synonyms:
Anthrax Lethal Factor (LF) Antrax lethal toxin lef | lethal factor
Type:
PROTEIN
Mol. Mass.:
93758.56
Organism:
Bacillus anthracis
Description:
ChEMBL_1460338
Residue:
809
  
Inhibitor
Name:
BDBM50340755
Synonyms:
(S)-2-(4-fluoro-3-methylbenzyl)-6-(4-fluorobenzylamino)-N-hydroxyhexanamide | CHEMBL1760450
Type:
Small organic molecule
Emp. Form.:
C21H26F2N2O2
Mol. Mass.:
376.4401
SMILES:
Cc1cc(C[C@H](CCCCNCc2ccc(F)cc2)C(=O)NO)ccc1F
: