Target
Lethal factor
Ligand
BDBM50340761
Substrate
Meas. Tech.
ChEMBL_740261 (CHEMBL1764161)
Ki
0.71±n/a nM
Citation
 Kim, SJiao, GSMoayeri, MCrown, DCregar-Hernandez, LMcKasson, LMargosiak, SALeppla, SHJohnson, AT Antidotes to anthrax lethal factor intoxication. Part 2: structural modifications leading to improved in vivo efficacy. Bioorg Med Chem Lett 21:2030-3 (2011)  
Target
Name:
Lethal factor
Synonyms:
Anthrax Lethal Factor (LF) Antrax lethal toxin lef | lethal factor
Type:
PROTEIN
Mol. Mass.:
93758.56
Organism:
Bacillus anthracis
Description:
ChEMBL_1460338
Residue:
809
  
Inhibitor
Name:
BDBM50340761
Synonyms:
(S)-6-(4-chlorobenzylamino)-2-(4-fluoro-3,5-dimethylbenzyl)-N-hydroxyhexanamide | CHEMBL1760315
Type:
Small organic molecule
Emp. Form.:
C22H28ClFN2O2
Mol. Mass.:
406.921
SMILES:
Cc1cc(C[C@H](CCCCNCc2ccc(Cl)cc2)C(=O)NO)cc(C)c1F
: