Target
11-beta-hydroxysteroid dehydrogenase type 2
Ligand
BDBM50340809
Substrate
Meas. Tech.
ChEMBL_740565 (CHEMBL1764828)
IC50
>4000±n/a nM
Citation
 Sun, WMaletic, MMundt, SSShah, KZokian, HLyons, KWaddell, STBalkovec, J Substituted phenyl triazoles as selective inhibitors of 11 β-Hydroxysteroid Dehydrogenase Type 1. Bioorg Med Chem Lett 21:2141-5 (2011)  
Target
Name:
11-beta-hydroxysteroid dehydrogenase type 2
Synonyms:
11-DH2 11-beta-Hydroxysteroid Dehydrogenase 2 (11-beta-HSD2) 11-beta-hydroxysteroid dehydrogenase 2 11-beta-hydroxysteroid dehydrogenase type 2 (11-beta-HSD2) DHI2_HUMAN HSD11K SDR9C3
Type:
Enzyme
Mol. Mass.:
44141.72
Organism:
Homo sapiens (Human)
Description:
Purified recombinant human 11beta-HSD2.
Residue:
405
  
Inhibitor
Name:
BDBM50340809
Synonyms:
3-Adamantan-1-yl-5,6,7,8,9,10-hexahydro-[1,2,4]triazolo[4,3-a]azocine | CHEMBL256778
Type:
Small organic molecule
Emp. Form.:
C18H27N3
Mol. Mass.:
285.4271
SMILES:
C1C2CC3CC1CC(C2)(C3)c1nnc2CCCCCCn12
: