Target
Bombesin receptor subtype-3
Ligand
BDBM50340977
Substrate
Meas. Tech.
ChEMBL_740068 (CHEMBL1763128)
EC50
>10000±n/a nM
Citation
 Lo, MMChobanian, HRPalyha, OKan, YKelly, TMGuan, XMReitman, MLDragovic, JLyons, KANargund, RPLin, LS Pyridinesulfonylureas and pyridinesulfonamides as selective bombesin receptor subtype-3 (BRS-3) agonists. Bioorg Med Chem Lett 21:2040-3 (2011)  
Target
Name:
Bombesin receptor subtype-3
Synonyms:
BRS3_MOUSE | Brs3
Type:
PROTEIN
Mol. Mass.:
44239.49
Organism:
Mus musculus
Description:
ChEMBL_1445902
Residue:
399
  
Inhibitor
Name:
BDBM50340977
Synonyms:
CHEMBL1762260 | N-(tert-butylcarbamoyl)-4-(pyrrolidin-1-ylamino)pyridine-3-sulfonamide
Type:
Small organic molecule
Emp. Form.:
C14H23N5O3S
Mol. Mass.:
341.429
SMILES:
CC(C)(C)NC(=O)NS(=O)(=O)c1cnccc1NN1CCCC1
: