Target
Cannabinoid receptor 1
Ligand
BDBM50341006
Substrate
Meas. Tech.
ChEMBL_740155 (CHEMBL1763215)
EC50
>20000±n/a nM
Citation
 Riether, DWu, LCirillo, PFBerry, AWalker, ERErmann, MNoya-Marino, BJenkins, JEAlbaugh, DAlbrecht, CFisher, MGemkow, MJGrbic, HLöbbe, SMöller, CO'Shea, KSauer, AShih, DTThomson, DS 1,4-Diazepane compounds as potent and selective CB2 agonists: optimization of metabolic stability. Bioorg Med Chem Lett 21:2011-6 (2011)  
Target
Name:
Cannabinoid receptor 1
Synonyms:
CANN6 CB-R CNR CNR1_HUMAN Cannabinoid receptor Cannabinoid receptor 1 (brain)
Type:
G Protein-Coupled Receptor (GPCR)
Mol. Mass.:
52868.96
Organism:
Homo sapiens (Human)
Description:
P21554
Residue:
472
  
Inhibitor
Name:
BDBM50341006
Synonyms:
CHEMBL1762425 | N-(5-tert-butylisoxazol-3-yl)-4-(piperidine-4-carbonyl)-1,4-diazepane-1-carboxamide
Type:
Small organic molecule
Emp. Form.:
C19H31N5O3
Mol. Mass.:
377.4811
SMILES:
CC(C)(C)c1cc(NC(=O)N2CCCN(CC2)C(=O)C2CCNCC2)no1
: