Target
Neuromedin-K receptor
Ligand
BDBM50341080
Substrate
Meas. Tech.
ChEMBL_740094 (CHEMBL1763154)
Ki
3700±n/a nM
Citation
 Hoveyda, HRRoy, MOBlanc, SNoël, SSalvino, JMAtor, MAFraser, G Discovery of 3-aryl-5-acylpiperazinyl-pyrazoles as antagonists to the NK3 receptor. Bioorg Med Chem Lett 21:1991-6 (2011)  
Target
Name:
Neuromedin-K receptor
Synonyms:
NK3R_RAT Tac3r | Tacr3
Type:
Mol. Mass.:
51128.60
Organism:
Rattus norvegicus
Description:
ChEMBL_10983
Residue:
452
  
Inhibitor
Name:
BDBM50341080
Synonyms:
(3-(4-chlorophenyl)-1-methyl-1H-pyrazol-5-yl)(4-(2-methoxyphenyl)piperazin-1-yl)methanone | CHEMBL1760205
Type:
Small organic molecule
Emp. Form.:
C22H23ClN4O2
Mol. Mass.:
410.897
SMILES:
COc1ccccc1N1CCN(CC1)C(=O)c1cc(nn1C)-c1ccc(Cl)cc1
: