Target
Peroxisome proliferator-activated receptor alpha
Ligand
BDBM50341146
Substrate
Meas. Tech.
ChEMBL_740363 (CHEMBL1764421)
EC50
3600±n/a nM
Citation
 Ushiroda, KMaruta, KTakazawa, TNagano, TTaiji, MKohno, TSato, YHorai, SYanagi, KNagata, R Synthesis and pharmacological evaluation of novel benzoylazole-based PPARa/κ activators. Bioorg Med Chem Lett 21:1978-82 (2011)  
Target
Name:
Peroxisome proliferator-activated receptor alpha
Synonyms:
NR1C1 PPAR PPAR-alpha PPARA_HUMAN Peroxisome proliferator-activated receptor | Peroxisome proliferator-activated receptor alpha (PPAR alpha)
Type:
Enzyme
Mol. Mass.:
52222.08
Organism:
Homo sapiens (Human)
Description:
Q07869
Residue:
468
  
Inhibitor
Name:
BDBM50341146
Synonyms:
(E)-2-(3-(3-(4,5-dimethyl-2-(4-methylbenzoyl)-1H-imidazol-1-yl)prop-1-enyl)phenoxy)-2-methylpropanoic acid | CHEMBL1760556
Type:
Small organic molecule
Emp. Form.:
C26H28N2O4
Mol. Mass.:
432.5115
SMILES:
Cc1nc(C(=O)c2ccc(C)cc2)n(C\C=C\c2cccc(OC(C)(C)C(O)=O)c2)c1C
: