Target
Amine oxidase [flavin-containing] B
Ligand
BDBM50341159
Substrate
Meas. Tech.
ChEMBL_740468 (CHEMBL1764623)
Ki
5.75±n/a nM
Citation
 Mishra, NSasmal, D Development of selective and reversible pyrazoline based MAO-B inhibitors: virtual screening, synthesis and biological evaluation. Bioorg Med Chem Lett 21:1969-73 (2011)  
Target
Name:
Amine oxidase [flavin-containing] B
Synonyms:
AOFB_HUMAN MAOB Monoamine oxidase type B (MAO B) Monoamine oxidase type B (MAOB)
Type:
Protein
Mol. Mass.:
58768.76
Organism:
Homo sapiens (Human)
Description:
P27338
Residue:
520
  
Inhibitor
Name:
BDBM50341159
Synonyms:
2-(3-(anthracen-9-yl)-4,5-dihydro-1H-pyrazol-5-yl)pyridine | CHEMBL1760720
Type:
Small organic molecule
Emp. Form.:
C22H17N3
Mol. Mass.:
323.3905
SMILES:
C1C(N=NC1c1c2ccccc2cc2ccccc12)c1ccccn1
: