Target
Neuronal acetylcholine receptor subunit alpha-4/beta-4
Ligand
BDBM50322528
Substrate
Meas. Tech.
ChEMBL_741894 (CHEMBL1768455)
IC50
11000±n/a nM
Citation
 Carroll, FIMuresan, AZBlough, BENavarro, HAMascarella, SWEaton, JBHuang, XDamaj, MILukas, RJ Synthesis of 2-(substituted phenyl)-3,5,5-trimethylmorpholine analogues and their effects on monoamine uptake, nicotinic acetylcholine receptor function, and behavioral effects of nicotine. J Med Chem 54:1441-8 (2011)  
Target
Name:
Neuronal acetylcholine receptor subunit alpha-4/beta-4
Synonyms:
Neuronal acetylcholine receptor protein alpha-4/beta-4 subunit | Neuronal acetylcholine receptor; alpha4/beta4
Type:
Mol. Mass.:
Description:
ASSAY_ID of EBI is 143890
Components:
This complex has 2 components.
Component 1
Name:
Neuronal acetylcholine receptor subunit beta-4
Synonyms:
ACHB4_HUMAN Cholinergic, Nicotinic Alpha6Beta3Beta4Alpha5 Nicotinic acetylcholine receptor alpha6/alpha3/beta4
Type:
Enzyme Catalytic Domain
Mol. Mass.:
56388.51
Organism:
Homo sapiens (Human)
Description:
Cholinergic, Nicotinic Alpha6Beta3Beta4Alpha5 0 HUMAN::P30926
Residue:
498
  
Component 2
Name:
Neuronal acetylcholine receptor subunit alpha-4
Synonyms:
ACHA4_HUMAN CHRNA4 protein Neuronal acetylcholine receptor protein alpha-4 subunit Nicotinic acetylcholine receptor alpha4/beta2/alpha5
Type:
Mol. Mass.:
69963.49
Organism:
Homo sapiens (Human)
Description:
NACHRA4
Residue:
627
  
Inhibitor
Name:
BDBM50322528
Synonyms:
(2S,3S)-2-(3-Bromophenyl)-3,5,5-trimethylmorpholin-2-ol | CHEMBL1173276
Type:
Small organic molecule
Emp. Form.:
C13H18BrNO2
Mol. Mass.:
300.192
SMILES:
C[C@@H]1NC(C)(C)CO[C@@]1(O)c1cccc(Br)c1
: