Target
Aurora kinase A
Ligand
BDBM50418251
Substrate
Meas. Tech.
ChEMBL_742330 (CHEMBL1768779)
IC50
794±n/a nM
Citation
 Medina, JRBecker, CJBlackledge, CWDuquenne, CFeng, YGrant, SWHeerding, DLi, WHMiller, WHRomeril, SPScherzer, DShu, ABobko, MAChadderton, ARDumble, MGardiner, CMGilbert, SLiu, QRabindran, SKSudakin, VXiang, HBrady, PGCampobasso, NWard, PAxten, JM Structure-based design of potent and selective 3-phosphoinositide-dependent kinase-1 (PDK1) inhibitors. J Med Chem 54:1871-95 (2011)  
Target
Name:
Aurora kinase A
Synonyms:
AIK ARK1 AURKA AYK1 Aurora kinase A (AURA) Aurora kinase A (Aurora A) Aurora-related kinase 1 BTAK Breast-tumor-amplified kinase STK15 Serine/threonine kinase 15 Serine/threonine-protein kinase aurora A hARK1
Type:
Serine/threonine-protein kinase
Mol. Mass.:
45830.98
Organism:
Homo sapiens (Human)
Description:
O14965
Residue:
403
  
Inhibitor
Name:
BDBM50418251
Synonyms:
CHEMBL1614776
Type:
Small organic molecule
Emp. Form.:
C22H30N8O2
Mol. Mass.:
438.526
SMILES:
C[C@H]1CC[C@H](CN1c1cc(nc(N)n1)-c1ccc2c(N)[nH]nc2c1)NC(=O)OC(C)(C)C
: