Target
Probable alpha-glucosidase Os06g0675700
Ligand
BDBM50341324
Substrate
Meas. Tech.
ChEMBL_742386 (CHEMBL1768944)
IC50
>100000±n/a nM
Citation
 Díaz, LCasas, JBujons, JLlebaria, ADelgado, A New glucocerebrosidase inhibitors by exploration of chemical diversity of N-substituted aminocyclitols using click chemistry and in situ screening. J Med Chem 54:2069-79 (2011)  
Target
Name:
Probable alpha-glucosidase Os06g0675700
Synonyms:
AGLU_ORYSJ
Type:
PROTEIN
Mol. Mass.:
96348.92
Organism:
Oryza sativa subsp. japonica
Description:
ChEMBL_796387
Residue:
885
  
Inhibitor
Name:
BDBM50341324
Synonyms:
CHEMBL1766482 | rel-(1R,2S,4R,5S)-6-[[1-Undecyl-1H-1,2,3-triazol-4-yl]methylamino]-cyclohexane-1,2,3,4,5-pentaol
Type:
Small organic molecule
Emp. Form.:
C20H38N4O5
Mol. Mass.:
414.5395
SMILES:
CCCCCCCCCCCn1cc(CN[C@@H]2[C@@H](O)[C@H](O)[C@@H](O)[C@H](O)[C@H]2O)nn1
: