Target
Alpha-galactosidase
Ligand
BDBM50318562
Substrate
Meas. Tech.
ChEMBL_742387 (CHEMBL1768945)
IC50
>100000±n/a nM
Citation
 Díaz, LCasas, JBujons, JLlebaria, ADelgado, A New glucocerebrosidase inhibitors by exploration of chemical diversity of N-substituted aminocyclitols using click chemistry and in situ screening. J Med Chem 54:2069-79 (2011)  
Target
Name:
Alpha-galactosidase
Synonyms:
α-galactosidase Alpha-galactosidase
Type:
Protein
Mol. Mass.:
41306.82
Organism:
Coffea arabica (Coffee beans)
Description:
Residue:
378
  
Inhibitor
Name:
BDBM50318562
Synonyms:
(1R,2S,3r,4R,5S,6s)-6-[(1-Decyl-1H-1,2,3-triazol-4-yl)methylamino]cyclohexane-1,2,3,4,5-pentaol | CHEMBL1082596
Type:
Small organic molecule
Emp. Form.:
C19H36N4O5
Mol. Mass.:
400.5129
SMILES:
CCCCCCCCCCn1cc(CN[C@@H]2[C@@H](O)[C@H](O)[C@@H](O)[C@H](O)[C@H]2O)nn1
: