Target
Hemagglutinin-neuraminidase
Ligand
BDBM50341457
Substrate
Meas. Tech.
ChEMBL_741750 (CHEMBL1769849)
IC50
2000000±n/a nM
Citation
 Nishino, RIkeda, KHayakawa, TTakahashi, TSuzuki, TSato, M Syntheses of 2-deoxy-2,3-didehydro-N-acetylneuraminic acid analogues modified by N-sulfonylamidino groups at the C-4 position and biological evaluation as inhibitors of human parainfluenza virus type 1. Bioorg Med Chem 19:2418-27 (2011)  
Target
Name:
Hemagglutinin-neuraminidase
Synonyms:
Type:
PROTEIN
Mol. Mass.:
64031.12
Organism:
Human parainfluenza virus 1
Description:
ChEMBL_741750
Residue:
575
  
Inhibitor
Name:
BDBM50341457
Synonyms:
5-Acetamido-2,6-anhydro-3,5-dideoxy-4-[2-(thiophen-2-yl)-N'-(methylsulfonyl)acetimidamido]-D-glycero-D-galactonon-2-enonic acid | CHEMBL1767335
Type:
Small organic molecule
Emp. Form.:
C18H25N3O9S2
Mol. Mass.:
491.536
SMILES:
CC(=O)N[C@H]1[C@@H](OC(=C[C@@H]1N=C(Cc1cccs1)NS(C)(=O)=O)C(O)=O)[C@H](O)[C@H](O)CO
: