Target
Mast/stem cell growth factor receptor Kit
Ligand
BDBM50341530
Substrate
Meas. Tech.
ChEMBL_741888 (CHEMBL1768449)
Ki
<10±n/a nM
Citation
 Charrier, JDMiller, AKay, DPBrenchley, GTwin, HCCollier, PNRamaya, SKeily, SBDurrant, SJKnegtel, RMTanner, AJBrown, KCurnock, APJimenez, JM Discovery and structure-activity relationship of 3-aminopyrid-2-ones as potent and selective interleukin-2 inducible T-cell kinase (Itk) inhibitors. J Med Chem 54:2341-50 (2011)  
Target
Name:
Mast/stem cell growth factor receptor Kit
Synonyms:
CD117 antigen KIT Mast/stem cell growth factor receptor Kit (cKIT) Proto-oncogene tyrosine-protein kinase Kit Stem cell growth factor receptor Tyrosine-protein kinase Kit c-kit v-kit Hardy-Zuckerman 4 feline sarcoma viral oncogene homolog
Type:
Protein
Mol. Mass.:
109869.37
Organism:
Homo sapiens (Human)
Description:
P10721
Residue:
976
  
Inhibitor
Name:
BDBM50341530
Synonyms:
3-(4-(Piperidin-1-yl)benzoylamino)-5-(2-(methylamino)pyrimidin-4-yl)-(1H)-pyridin-2-one N-{5-[2-(methylamino)pyrimidin-4-yl]-2-oxo-1,2-dihydropyridin-3-yl}-4-(piperidin-1-yl)benzamide
Type:
Small organic molecule
Emp. Form.:
C22H24N6O2
Mol. Mass.:
404.465
SMILES:
CNc1nccc(n1)-c1c[nH]c(=O)c(NC(=O)c2ccc(cc2)N2CCCCC2)c1
: