Target
Inhibitor of nuclear factor kappa-B kinase subunit alpha
Ligand
BDBM50341519
Substrate
Meas. Tech.
ChEMBL_742129 (CHEMBL1769189)
Ki
>1000±n/a nM
Citation
 Charrier, JDMiller, AKay, DPBrenchley, GTwin, HCCollier, PNRamaya, SKeily, SBDurrant, SJKnegtel, RMTanner, AJBrown, KCurnock, APJimenez, JM Discovery and structure-activity relationship of 3-aminopyrid-2-ones as potent and selective interleukin-2 inducible T-cell kinase (Itk) inhibitors. J Med Chem 54:2341-50 (2011)  
Target
Name:
Inhibitor of nuclear factor kappa-B kinase subunit alpha
Synonyms:
CHUK I-kappa-B kinase 1 IKK-A IKK1 IKKA IkBKA Inhibitor of NF-kappa-B kinase alpha/beta Nuclear factor NF-kappa-B inhibitor kinase alpha TCF16 | Transcription factor 16
Type:
PROTEIN
Mol. Mass.:
84642.21
Organism:
Homo sapiens (Human)
Description:
ChEMBL_327453
Residue:
745
  
Inhibitor
Name:
BDBM50341519
Synonyms:
(S)-3-(4-(2-(pyrrolidin-1-ylmethyl)pyrrolidin-1-yl)benzoylamino)-5-(6-(methylamino)pyrazin-2-yl)-(1H)-pyridin-2-one | CHEMBL1765781
Type:
Small organic molecule
Emp. Form.:
C26H31N7O2
Mol. Mass.:
473.57
SMILES:
CNc1cncc(n1)-c1c[nH]c(=O)c(NC(=O)c2ccc(cc2)N2CCC[C@H]2CN2CCCC2)c1
: