Target
Receptor-type tyrosine-protein kinase FLT3
Ligand
BDBM50341528
Substrate
Meas. Tech.
ChEMBL_742046 (CHEMBL1768909)
Ki
80±n/a nM
Citation
 Charrier, JDMiller, AKay, DPBrenchley, GTwin, HCCollier, PNRamaya, SKeily, SBDurrant, SJKnegtel, RMTanner, AJBrown, KCurnock, APJimenez, JM Discovery and structure-activity relationship of 3-aminopyrid-2-ones as potent and selective interleukin-2 inducible T-cell kinase (Itk) inhibitors. J Med Chem 54:2341-50 (2011)  
Target
Name:
Receptor-type tyrosine-protein kinase FLT3
Synonyms:
CD135 FL cytokine receptor FLK2 FLT3 Fetal liver kinase-2 Fms-like tyrosine kinase 3 (Flt-3) STK-1 Stem cell tyrosine kinase 1
Type:
Enzyme
Mol. Mass.:
112888.62
Organism:
Homo sapiens (Human)
Description:
P36888
Residue:
993
  
Inhibitor
Name:
BDBM50341528
Synonyms:
(S)-3-(4-(2-(pyrrolidin-1-ylmethyl)pyrrolidin-1-yl)benzoylamino)-5-(3-fluoro-5-(methylamino)phenyl)-(1H)-pyridin-2-one | CHEMBL1765783
Type:
Small organic molecule
Emp. Form.:
C28H32FN5O2
Mol. Mass.:
489.5844
SMILES:
CNc1cc(F)cc(c1)-c1c[nH]c(=O)c(NC(=O)c2ccc(cc2)N2CCC[C@H]2CN2CCCC2)c1
: