Target
Steroidogenic factor 1
Ligand
BDBM22385
Substrate
Meas. Tech.
ChEMBL_743680 (CHEMBL1767449)
EC50
39.81±n/a nM
Citation
 Whitby, RJStec, JBlind, RDDixon, SLeesnitzer, LMOrband-Miller, LAWilliams, SPWillson, TMXu, RZuercher, WJCai, FIngraham, HA Small molecule agonists of the orphan nuclear receptors steroidogenic factor-1 (SF-1, NR5A1) and liver receptor homologue-1 (LRH-1, NR5A2). J Med Chem 54:2266-81 (2011)  
Target
Name:
Steroidogenic factor 1
Synonyms:
AD4BP FTZF1 NR5A1 SF-1 STF-1 Steroid hormone receptor Ad4BP
Type:
Nuclear Hormone Receptor
Mol. Mass.:
51643.43
Organism:
Homo sapiens (Human)
Description:
Residue:
461
  
Inhibitor
Name:
BDBM22385
Synonyms:
(3aS,6aR)-5-hexyl-N,4-diphenyl-1,2,3,3a,6,6a-hexahydropentalen-3a-amine | bicyclo[3.3.0]-oct-2-ene, 5m
Type:
Small organic molecule
Emp. Form.:
C26H33N
Mol. Mass.:
359.5469
SMILES:
[H][C@]12CCC[C@@]1(Nc1ccccc1)C(=C(CCCCCC)C2)c1ccccc1
: