Target
Receptor tyrosine-protein kinase erbB-2
Ligand
BDBM50341628
Substrate
Meas. Tech.
ChEMBL_743117 (CHEMBL1768693)
IC50
>10000±n/a nM
Citation
 Wang, YAi, JWang, YChen, YWang, LLiu, GGeng, MZhang, A Synthesis and c-Met kinase inhibition of 3,5-disubstituted and 3,5,7-trisubstituted quinolines: identification of 3-(4-acetylpiperazin-1-yl)-5-(3-nitrobenzylamino)-7- (trifluoromethyl)quinoline as a novel anticancer agent. J Med Chem 54:2127-42 (2011)  
Target
Name:
Receptor tyrosine-protein kinase erbB-2
Synonyms:
2.7.10.1 CD_antigen=CD340 ERBB2_HUMAN FASN/HER2 HER2 MLN19 NEU Proto-oncogene Neu Tyrosine kinase-type cell surface receptor HER2 | p185erbB2
Type:
Mol. Mass.:
137894.47
Organism:
Homo sapiens (Human)
Description:
P04626
Residue:
1255
  
Inhibitor
Name:
BDBM50341628
Synonyms:
3-(4-Acetylpiperazin-1-yl)-5-(3-nitrobenzylamino)-7-(trifluoromethyl)quinoline | CHEMBL1766529
Type:
Small organic molecule
Emp. Form.:
C23H22F3N5O3
Mol. Mass.:
473.4477
SMILES:
CC(=O)N1CCN(CC1)c1cnc2cc(cc(NCc3cccc(c3)[N+]([O-])=O)c2c1)C(F)(F)F
: