Target
Hepatocyte growth factor receptor
Ligand
BDBM50341645
Substrate
Meas. Tech.
ChEMBL_743092 (CHEMBL1768668)
IC50
2.7±n/a nM
Citation
 Wang, YAi, JWang, YChen, YWang, LLiu, GGeng, MZhang, A Synthesis and c-Met kinase inhibition of 3,5-disubstituted and 3,5,7-trisubstituted quinolines: identification of 3-(4-acetylpiperazin-1-yl)-5-(3-nitrobenzylamino)-7- (trifluoromethyl)quinoline as a novel anticancer agent. J Med Chem 54:2127-42 (2011)  
Target
Name:
Hepatocyte growth factor receptor
Synonyms:
Hepatocyte growth factor receptor Hepatocyte growth factor receptor (c-MET) MET Met proto-oncogene (hepatocyte growth factor receptor) Tyrosine-protein kinase Met (c-Met) c-Met kinase
Type:
Protein
Mol. Mass.:
155559.73
Organism:
Homo sapiens (Human)
Description:
P08581
Residue:
1390
  
Inhibitor
Name:
BDBM50341645
Synonyms:
3-(4-Methylpiperazin-1-yl)-5-(3-nitrobenzyloxy)-7-(trifluoromethyl)quinoline | CHEMBL1766541
Type:
Small organic molecule
Emp. Form.:
C22H21F3N4O3
Mol. Mass.:
446.4223
SMILES:
CN1CCN(CC1)c1cnc2cc(cc(OCc3cccc(c3)[N+]([O-])=O)c2c1)C(F)(F)F
: