Target
Nitric oxide synthase, endothelial
Ligand
BDBM50341687
Substrate
Meas. Tech.
ChEMBL_743327 (CHEMBL1767574)
Ki
1740±n/a nM
Citation
 Xue, FFang, JDelker, SLLi, HMartásek, PRoman, LJPoulos, TLSilverman, RB Symmetric double-headed aminopyridines, a novel strategy for potent and membrane-permeable inhibitors of neuronal nitric oxide synthase. J Med Chem 54:2039-48 (2011)  
Target
Name:
Nitric oxide synthase, endothelial
Synonyms:
Constitutive NOS Endothelial nitric oxide synthase NOS type III NOS3_BOVIN Nitric-oxide synthase, endothelial | cNOS
Type:
Enzyme
Mol. Mass.:
133292.26
Organism:
Bos taurus (bovine)
Description:
Recombinant eNOS overexpressed in E. coli was used in enzyme assays.
Residue:
1205
  
Inhibitor
Name:
BDBM50341687
Synonyms:
6,6'-(2,2'-(Naphthalene-2,6-diyl)bis(ethane-2,1-diyl))bis(4-methylpyridin-2-amine) | CHEMBL1766628
Type:
Small organic molecule
Emp. Form.:
C26H28N4
Mol. Mass.:
396.5273
SMILES:
Cc1cc(N)nc(CCc2ccc3cc(CCc4cc(C)cc(N)n4)ccc3c2)c1
: