Target
Serine-protein kinase ATM
Ligand
BDBM50341740
Substrate
Meas. Tech.
ChEMBL_743383 (CHEMBL1767682)
IC50
>8000±n/a nM
Citation
 Charrier, JDDurrant, SJGolec, JMKay, DPKnegtel, RMMacCormick, SMortimore, MO'Donnell, MEPinder, JLReaper, PMRutherford, APWang, PSYoung, SCPollard, JR Discovery of potent and selective inhibitors of ataxia telangiectasia mutated and Rad3 related (ATR) protein kinase as potential anticancer agents. J Med Chem 54:2320-30 (2011)  
Target
Name:
Serine-protein kinase ATM
Synonyms:
A-T mutated ATM_HUMAN | Ataxia telangiectasia mutated
Type:
Protein
Mol. Mass.:
350696.72
Organism:
Homo sapiens (Human)
Description:
Q13315
Residue:
3056
  
Inhibitor
Name:
BDBM50341740
Synonyms:
3-amino-6-(4-(azetidine-1-carbonyl)phenyl)-N-phenylpyrazine-2-carboxamide US10479784, Compound I-72 | US10961232, Compound I-72
Type:
Small organic molecule
Emp. Form.:
C21H19N5O2
Mol. Mass.:
373.4079
SMILES:
Nc1ncc(nc1C(=O)Nc1ccccc1)-c1ccc(cc1)C(=O)N1CCC1
: