Target
Serine-protein kinase ATM
Ligand
BDBM50341753
Substrate
Meas. Tech.
ChEMBL_743383 (CHEMBL1767682)
IC50
5000±n/a nM
Citation
 Charrier, JDDurrant, SJGolec, JMKay, DPKnegtel, RMMacCormick, SMortimore, MO'Donnell, MEPinder, JLReaper, PMRutherford, APWang, PSYoung, SCPollard, JR Discovery of potent and selective inhibitors of ataxia telangiectasia mutated and Rad3 related (ATR) protein kinase as potential anticancer agents. J Med Chem 54:2320-30 (2011)  
Target
Name:
Serine-protein kinase ATM
Synonyms:
A-T mutated ATM_HUMAN | Ataxia telangiectasia mutated
Type:
Protein
Mol. Mass.:
350696.72
Organism:
Homo sapiens (Human)
Description:
Q13315
Residue:
3056
  
Inhibitor
Name:
BDBM50341753
Synonyms:
(R)-3-amino-N-phenyl-6-(4-((tetrahydrofuran-3-yl)sulfonyl)-phenyl)pyrazine-2-carboxamide | CHEMBL1766799
Type:
Small organic molecule
Emp. Form.:
C21H20N4O4S
Mol. Mass.:
424.473
SMILES:
Nc1ncc(nc1C(=O)Nc1ccccc1)-c1ccc(cc1)S(=O)(=O)[C@@H]1CCOC1
: