Target
Collagenase 3
Ligand
BDBM50311088
Substrate
Meas. Tech.
ChEMBL_743613 (CHEMBL1768156)
IC50
3.4±n/a nM
Citation
 Shiozaki, MMaeda, KMiura, TKotoku, MYamasaki, TMatsuda, IAoki, KYasue, KImai, HUbukata, MSuma, AYokota, MHotta, TTanaka, MHase, YHaas, JFryer, AMLaird, ERLittmann, NMAndrews, SWJosey, JAMimura, TShinozaki, YYoshiuchi, HInaba, T Discovery of (1S,2R,3R)-2,3-dimethyl-2-phenyl-1-sulfamidocyclopropanecarboxylates: novel and highly selective aggrecanase inhibitors. J Med Chem 54:2839-63 (2011)  
Target
Name:
Collagenase 3
Synonyms:
MMP-13 MMP13_HUMAN Matrix metalloproteinase-13 (MMP-13) | Matrix metalloproteinase-13 (MMP13)
Type:
Enzyme
Mol. Mass.:
53808.06
Organism:
Homo sapiens (Human)
Description:
P45452
Residue:
471
  
Inhibitor
Name:
BDBM50311088
Synonyms:
CHEMBL1078281 | cis-rac-1-(5-(4-chloro-1H-pyrazol-1-yl)thiophene-2-sulfonamido)-2-methyl-3-phenylcyclopropanecarboxylic acid
Type:
Small organic molecule
Emp. Form.:
C18H16ClN3O4S2
Mol. Mass.:
437.92
SMILES:
C[C@@H]1[C@H](c2ccccc2)[C@]1(NS(=O)(=O)c1ccc(s1)-n1cc(Cl)cn1)C(O)=O
: