Target
Isoform 4 of Lethal(3)malignant brain tumor-like protein 1 (4)
Ligand
BDBM50341828
Substrate
Meas. Tech.
ChEMBL_743696 (CHEMBL1767465)
Kd
1E4±n/a nM
Citation
 Herold, JMWigle, TJNorris, JLLam, RKorboukh, VKGao, CIngerman, LAKireev, DBSenisterra, GVedadi, MTripathy, ABrown, PJArrowsmith, CHJin, JJanzen, WPFrye, SV Small-molecule ligands of methyl-lysine binding proteins. J Med Chem 54:2504-11 (2011)  
Target
Name:
Isoform 4 of Lethal(3)malignant brain tumor-like protein 1 (4)
Synonyms:
H-l(3)mbt KIAA0681 L(3)mbt-like L3MBTL LMBL1_HUMAN Lethal(3)malignant brain tumor-like protein 1 (4) | Lethal(3)malignant brain tumor-like protein 1 (L3MBTL1)
Type:
Protein
Mol. Mass.:
83871.06
Organism:
Homo sapiens (Human)
Description:
Q9Y468-4
Residue:
752
  
Inhibitor
Name:
BDBM50341828
Synonyms:
3-bromo-5-[(4-pyrrolidin-1-ylpiperidin-1-yl)carbonyl]pyridine CHEMBL1235119
Type:
Small organic molecule
Emp. Form.:
C15H20BrN3O
Mol. Mass.:
338.243
SMILES:
Brc1cncc(c1)C(=O)N1CCC(CC1)N1CCCC1
: