Target
Poly [ADP-ribose] polymerase 2
Ligand
BDBM50341857
Substrate
Meas. Tech.
ChEMBL_743712 (CHEMBL1767526)
IC50
1600±n/a nM
Citation
 Sunderland, PTWoon, ECDhami, ABergin, ABMahon, MFWood, PJJones, LATully, SRLloyd, MDThompson, ASJavaid, HMartin, NMThreadgill, MD 5-Benzamidoisoquinolin-1-ones and 5-(κ-carboxyalkyl)isoquinolin-1-ones as isoform-selective inhibitors of poly(ADP-ribose) polymerase 2 (PARP-2). J Med Chem 54:2049-59 (2011)  
Target
Name:
Poly [ADP-ribose] polymerase 2
Synonyms:
2.4.2.- ADP-ribosyltransferase diphtheria toxin-like 2 ARTD2 Adprtl2 DNA ADP-ribosyltransferase PARP2 PARP-2 Parp2 Poly [ADP-ribose] polymerase 2 (Parp2) Poly[ADP-ribose] synthase 2 Protein poly-ADP-ribosyltransferase PARP2 pADPRT-2 | poly-ADP-ribose polymerase 2 (PARP2)
Type:
Mol. Mass.:
63409.97
Organism:
Mus musculus (Mouse)
Description:
Alexis Biochemicals, Cat. no. ALX-201-064-C020
Residue:
559
  
Inhibitor
Name:
BDBM50341857
Synonyms:
5-Amino-2-(2-carboxyethyl)isoquinolin-1-one | CHEMBL1767066
Type:
Small organic molecule
Emp. Form.:
C12H12N2O3
Mol. Mass.:
232.2353
SMILES:
Nc1cccc2c1ccn(CCC(O)=O)c2=O
: