Target
Poly [ADP-ribose] polymerase 2
Ligand
BDBM50341863
Substrate
Meas. Tech.
ChEMBL_743712 (CHEMBL1767526)
IC50
1600±n/a nM
Citation
 Sunderland, PTWoon, ECDhami, ABergin, ABMahon, MFWood, PJJones, LATully, SRLloyd, MDThompson, ASJavaid, HMartin, NMThreadgill, MD 5-Benzamidoisoquinolin-1-ones and 5-(κ-carboxyalkyl)isoquinolin-1-ones as isoform-selective inhibitors of poly(ADP-ribose) polymerase 2 (PARP-2). J Med Chem 54:2049-59 (2011)  
Target
Name:
Poly [ADP-ribose] polymerase 2
Synonyms:
2.4.2.- ADP-ribosyltransferase diphtheria toxin-like 2 ARTD2 Adprtl2 DNA ADP-ribosyltransferase PARP2 PARP-2 Parp2 Poly [ADP-ribose] polymerase 2 (Parp2) Poly[ADP-ribose] synthase 2 Protein poly-ADP-ribosyltransferase PARP2 pADPRT-2 | poly-ADP-ribose polymerase 2 (PARP2)
Type:
Mol. Mass.:
63409.97
Organism:
Mus musculus (Mouse)
Description:
Alexis Biochemicals, Cat. no. ALX-201-064-C020
Residue:
559
  
Inhibitor
Name:
BDBM50341863
Synonyms:
5-(4-Nitrobenzamido)isoquinolin-1-one | CHEMBL1767056
Type:
Small organic molecule
Emp. Form.:
C16H11N3O4
Mol. Mass.:
309.2762
SMILES:
[O-][N+](=O)c1ccc(cc1)C(=O)Nc1cccc2c1cc[nH]c2=O
: