Target
Solanesyl diphosphate synthase
Ligand
BDBM50341910
Substrate
Meas. Tech.
ChEMBL_743415 (CHEMBL1767769)
IC50
>10000±n/a nM
Citation
 Rosso, VSSzajnman, SHMalayil, LGalizzi, MMoreno, SNDocampo, RRodriguez, JB Synthesis and biological evaluation of new 2-alkylaminoethyl-1,1-bisphosphonic acids against Trypanosoma cruzi and Toxoplasma gondii targeting farnesyl diphosphate synthase. Bioorg Med Chem 19:2211-7 (2011)  
Target
Name:
Solanesyl diphosphate synthase
Synonyms:
Farnesyl synthetase, putative | Solanesyl diphosphate synthase
Type:
PROTEIN
Mol. Mass.:
39372.51
Organism:
Trypanosoma cruzi
Description:
ChEMBL_469918
Residue:
363
  
Inhibitor
Name:
BDBM50341910
Synonyms:
1-[(Benzylamino)ethyl]1,1-bisphosphonic acid | CHEMBL1765145
Type:
Small organic molecule
Emp. Form.:
C9H15NO6P2
Mol. Mass.:
295.166
SMILES:
OP(O)(=O)C(CNCc1ccccc1)P(O)(O)=O
: