Target
Oxytocin receptor
Ligand
BDBM50205990
Substrate
Meas. Tech.
ChEMBL_743728 (CHEMBL1767542)
EC50
10.8±n/a nM
Citation
 Corbani, MTrueba, MStoev, SMurat, BMion, JBoulay, VGuillon, GManning, M Design, synthesis, and pharmacological characterization of fluorescent peptides for imaging human V1b vasopressin or oxytocin receptors. J Med Chem 54:2864-77 (2011)  
Target
Name:
Oxytocin receptor
Synonyms:
OT-R OXYR_HUMAN | Oxytocin
Type:
Enzyme Catalytic Domain
Mol. Mass.:
42793.26
Organism:
Homo sapiens (Human)
Description:
Oxytocin OXTR HEK293::B2R9L7
Residue:
389
  
Inhibitor
Name:
BDBM50205990
Synonyms:
CHEMBL395429 | OXYTOCIN
Type:
Small organic molecule
Emp. Form.:
C43H66N12O12S2
Mol. Mass.:
1007.187
SMILES:
CC[C@H](C)[C@@H]1NC(=O)[C@H](Cc2ccc(O)cc2)NC(=O)[C@@H](N)CSSC[C@H](NC(=O)[C@H](CC(N)=O)NC(=O)[C@H](CCC(N)=O)NC1=O)C(=O)N1CCC[C@H]1C(=O)N[C@@H](CC(C)C)C(=O)NCC(N)=O
: