Target
Cytochrome P450 26A1
Ligand
BDBM50342128
Substrate
Meas. Tech.
ChEMBL_744044 (CHEMBL1768149)
IC50
3±n/a nM
Citation
 Gomaa, MSBridgens, CEAboraia, ASVeal, GJRedfern, CPBrancale, AArmstrong, JLSimons, C Small molecule inhibitors of retinoic acid 4-hydroxylase (CYP26): synthesis and biological evaluation of imidazole methyl 3-(4-(aryl-2-ylamino)phenyl)propanoates. J Med Chem 54:2778-91 (2011)  
Target
Name:
Cytochrome P450 26A1
Synonyms:
CP26A_HUMAN CYP26A1 Cytochrome P450 26A1 P450RAI1 | Retinoic acid 4-hydroxylase
Type:
Enzyme
Mol. Mass.:
56216.16
Organism:
Homo sapiens (Human)
Description:
O43174
Residue:
497
  
Inhibitor
Name:
BDBM50342128
Synonyms:
3-Imidazol-1-yl-2-methyl-3-[4-(naphthalen-2-ylamino)-phenyl]-propionicAcid Methyl Ester | CHEMBL1766005
Type:
Small organic molecule
Emp. Form.:
C25H25N3O2
Mol. Mass.:
399.4849
SMILES:
COC(=O)C(C)(C)C(c1ccc(Nc2ccc3ccccc3c2)cc1)n1ccnc1
: