Target
Cytochrome P450 3A4
Ligand
BDBM50342133
Substrate
Meas. Tech.
ChEMBL_742780 (CHEMBL1769739)
IC50
11000±n/a nM
Citation
 Gomaa, MSBridgens, CEAboraia, ASVeal, GJRedfern, CPBrancale, AArmstrong, JLSimons, C Small molecule inhibitors of retinoic acid 4-hydroxylase (CYP26): synthesis and biological evaluation of imidazole methyl 3-(4-(aryl-2-ylamino)phenyl)propanoates. J Med Chem 54:2778-91 (2011)  
Target
Name:
Cytochrome P450 3A4
Synonyms:
Albendazole monooxygenase CP3A4_HUMAN CYP3A4 CYPIIIA4 Cytochrome P450 3A4 (CYP3A4) Nifedipine oxidase Taurochenodeoxycholate 6-alpha-hydroxylase
Type:
Enzyme
Mol. Mass.:
57349.57
Organism:
Homo sapiens (Human)
Description:
Residue:
503
  
Inhibitor
Name:
BDBM50342133
Synonyms:
Benzothiazol-2-yl-[4-((1S,2S)-2-dimethylamino-1-imidazol-1-yl-propyl)-phenyl]-amine N-(4-((1R,2R)-2-(dimethylamino)-1-(1H-imidazol-1-yl)propyl)phenyl)benzo[d]thiazol-2-amine | R-116010
Type:
Small organic molecule
Emp. Form.:
C21H23N5S
Mol. Mass.:
377.506
SMILES:
C[C@H]([C@@H](c1ccc(Nc2nc3ccccc3s2)cc1)n1ccnc1)N(C)C
: