Target
Bifunctional epoxide hydrolase 2
Ligand
BDBM50217448
Substrate
Meas. Tech.
ChEMBL_742954 (CHEMBL1768321)
IC50
0.5±n/a nM
Citation
 Hwang, SHWagner, KMMorisseau, CLiu, JYDong, HWecksler, ATHammock, BD Synthesis and structure-activity relationship studies of urea-containing pyrazoles as dual inhibitors of cyclooxygenase-2 and soluble epoxide hydrolase. J Med Chem 54:3037-50 (2011)  
Target
Name:
Bifunctional epoxide hydrolase 2
Synonyms:
Cytosolic epoxide hydrolase 2 EPHX2 HYES_HUMAN Soluble epoxide hydrolase (sEH) | epoxide hydrolase 2, cytoplasmic
Type:
Enzyme
Mol. Mass.:
62613.07
Organism:
Homo sapiens (Human)
Description:
P34913
Residue:
555
  
Inhibitor
Name:
BDBM50217448
Synonyms:
CHEMBL242459 trans-4-[4-(3-adamantan-1-ylureido)cyclohexyloxy]benzoic acid
Type:
Small organic molecule
Emp. Form.:
C24H32N2O4
Mol. Mass.:
412.5219
SMILES:
OC(=O)c1ccc(O[C@H]2CC[C@@H](CC2)NC(=O)NC23CC4CC(CC(C4)C2)C3)cc1
: