Target
TGF-beta receptor type-1
Ligand
BDBM50298220
Substrate
Meas. Tech.
ChEMBL_743052 (CHEMBL1768523)
IC50
54±n/a nM
Citation
 Jin, CHKrishnaiah, MSreenu, DRao, KSSubrahmanyam, VBPark, CYSon, JYSheen, YYKim, DK Synthesis and biological evaluation of 1-substituted-3(5)-(6-methylpyridin-2-yl)-4-(quinolin-6-yl)pyrazoles as transforming growth factor-β type 1 receptor kinase inhibitors. Bioorg Med Chem 19:2633-40 (2011)  
Target
Name:
TGF-beta receptor type-1
Synonyms:
ALK-5 Activin A receptor type II-like protein kinase of 53kD SKR4 TGF-beta receptor type I TGFBR1 TGFR1_HUMAN Transforming growth factor-beta receptor type I
Type:
enzyme
Mol. Mass.:
55968.24
Organism:
Homo sapiens (Human)
Description:
P36897
Residue:
503
  
Inhibitor
Name:
BDBM50298220
Synonyms:
2-(4-(benzo[d][1,3]dioxol-5-yl)-2-tert-butyl-1H-imidazol-5-yl)-6-methylpyridine CHEMBL1824446 SB-505124 | US11759530, Compound Table1.2
Type:
Small organic molecule
Emp. Form.:
C20H21N3O2
Mol. Mass.:
335.3996
SMILES:
Cc1cccc(n1)-c1nc([nH]c1-c1ccc2OCOc2c1)C(C)(C)C
: