Target
Neurotensin receptor type 2
Ligand
BDBM50342245
Substrate
Meas. Tech.
ChEMBL_743647 (CHEMBL1768190)
Ki
4.4±n/a nM
Citation
 Einsiedel, JHeld, CHervet, MPlomer, MTschammer, NHübner, HGmeiner, P Discovery of highly potent and neurotensin receptor 2 selective neurotensin mimetics. J Med Chem 54:2915-23 (2011)  
Target
Name:
Neurotensin receptor type 2
Synonyms:
Levocabastine-sensitive neurotensin receptor NTR2 NTR2_HUMAN Neurotensin receptor Neurotensin receptor type 2
Type:
PROTEIN
Mol. Mass.:
45404.76
Organism:
Homo sapiens (Human)
Description:
ChEMBL_1281495
Residue:
410
  
Inhibitor
Name:
BDBM50342245
Synonyms:
(S)-2-((2S,3S)-2-(2-((S)-1-((S)-2-((S)-2,6-diaminohexanamido)-5-guanidinopentanoyl)-N-(4-hydroxyphenethyl)pyrrolidine-2-carboxamido)acetamido)-3-methylpentanamido)-4-methylpentanoic acid | CHEMBL1766945
Type:
Small organic molecule
Emp. Form.:
C39H66N10O8
Mol. Mass.:
803.0035
SMILES:
[#6]-[#6]-[#6@H](-[#6])-[#6@H](-[#7]-[#6](=O)-[#6]-[#7](-[#6]-[#6]-c1ccc(-[#8])cc1)-[#6](=O)-[#6@@H]-1-[#6]-[#6]-[#6]-[#7]-1-[#6](=O)-[#6@H](-[#6]-[#6]-[#6]\[#7]=[#6](\[#7])-[#7])-[#7]-[#6](=O)-[#6@@H](-[#7])-[#6]-[#6]-[#6]-[#6]-[#7])-[#6](=O)-[#7]-[#6@@H](-[#6]-[#6](-[#6])-[#6])-[#6](-[#8])=O
: