Target
Neurotensin receptor type 2
Ligand
BDBM50342242
Substrate
Meas. Tech.
ChEMBL_743647 (CHEMBL1768190)
Ki
6.1±n/a nM
Citation
 Einsiedel, JHeld, CHervet, MPlomer, MTschammer, NHübner, HGmeiner, P Discovery of highly potent and neurotensin receptor 2 selective neurotensin mimetics. J Med Chem 54:2915-23 (2011)  
Target
Name:
Neurotensin receptor type 2
Synonyms:
Levocabastine-sensitive neurotensin receptor NTR2 NTR2_HUMAN Neurotensin receptor Neurotensin receptor type 2
Type:
PROTEIN
Mol. Mass.:
45404.76
Organism:
Homo sapiens (Human)
Description:
ChEMBL_1281495
Residue:
410
  
Inhibitor
Name:
BDBM50342242
Synonyms:
(S)-2-((2S,3S)-2-((S)-2-((S)-1-((S)-6-amino-2-((S)-2,6-diaminohexanamido)hexanoyl)pyrrolidine-2-carboxamido)-3-(4-hydroxyphenyl)propanamido)-3-methylpentanamido)-4-methylpentanoic acid H-Lys-Lys-Pro-Tyr-Ile-Leu-OH
Type:
Small organic molecule
Emp. Form.:
C38H64N8O8
Mol. Mass.:
760.9636
SMILES:
CC[C@H](C)[C@H](NC(=O)[C@H](Cc1ccc(O)cc1)NC(=O)[C@@H]1CCCN1C(=O)[C@H](CCCCN)NC(=O)[C@@H](N)CCCCN)C(=O)N[C@@H](CC(C)C)C(O)=O
: