Target
Neurotensin receptor type 1
Ligand
BDBM50342247
Substrate
Meas. Tech.
ChEMBL_743646 (CHEMBL1768189)
Ki
250±n/a nM
Citation
 Einsiedel, JHeld, CHervet, MPlomer, MTschammer, NHübner, HGmeiner, P Discovery of highly potent and neurotensin receptor 2 selective neurotensin mimetics. J Med Chem 54:2915-23 (2011)  
Target
Name:
Neurotensin receptor type 1
Synonyms:
Dopamine receptor D2L/neurotensin receptor NTS1 NTRR Neurotensin receptor 1 | neurotensin receptor type 1
Type:
PROTEIN
Mol. Mass.:
46278.89
Organism:
Homo sapiens (Human)
Description:
ChEMBL_1453811
Residue:
418
  
Inhibitor
Name:
BDBM50342247
Synonyms:
(S)-2-((3S,4S)-3-((S)-2-((S)-1-((S)-2-((S)-2-amino-5-guanidinopentanamido)-5-guanidinopentanoyl)pyrrolidine-2-carboxamido)-3-(4-hydroxyphenyl)propanamido)-4-methylhexanamido)-4-methylpentanoic acid | CHEMBL1766938
Type:
Small organic molecule
Emp. Form.:
C39H66N12O8
Mol. Mass.:
831.0169
SMILES:
[#6]-[#6]-[#6@H](-[#6])-[#6@H](-[#6]-[#6](=O)-[#7]-[#6@@H](-[#6]-[#6](-[#6])-[#6])-[#6](-[#8])=O)-[#7]-[#6](=O)-[#6@H](-[#6]-c1ccc(-[#8])cc1)-[#7]-[#6](=O)-[#6@@H]-1-[#6]-[#6]-[#6]-[#7]-1-[#6](=O)-[#6@H](-[#6]-[#6]-[#6]\[#7]=[#6](\[#7])-[#7])-[#7]-[#6](=O)-[#6@@H](-[#7])-[#6]-[#6]-[#6]\[#7]=[#6](\[#7])-[#7]
: