Target
Mitogen-activated protein kinase 8
Ligand
BDBM50342301
Substrate
Meas. Tech.
ChEMBL_742812 (CHEMBL1769815)
Kd
3.1E3±n/a nM
Citation
 De, SKBarile, EChen, VStebbins, JLCellitti, JFMachleidt, TCarlson, CBYang, LDahl, RPellecchia, M Design, synthesis, and structure-activity relationship studies of thiophene-3-carboxamide derivatives as dual inhibitors of the c-Jun N-terminal kinase. Bioorg Med Chem 19:2582-8 (2011)  
Target
Name:
Mitogen-activated protein kinase 8
Synonyms:
JNK-46 JNK1-alpha-1 MK08_HUMAN PRKM8 SAPK1C c-Jun N-terminal kinase 1 c-Jun N-terminal kinase 1(JNK1) | c-Jun N-terminal kinase 2 (JNK2)
Type:
Enzyme
Mol. Mass.:
48297.57
Organism:
Homo sapiens (Human)
Description:
JNK-1 was purchased from Upstate Cell Signaling Solutions (formerly Upstate Biotechnology).
Residue:
427
  
Inhibitor
Name:
BDBM50342301
Synonyms:
2-(2-(benzo[b]thiophen-3-yl)acetamido)thiophene-3-carboxamide | CHEMBL1767254
Type:
Small organic molecule
Emp. Form.:
C15H12N2O2S2
Mol. Mass.:
316.398
SMILES:
NC(=O)c1ccsc1NC(=O)Cc1csc2ccccc12
: