Target
Hydroxycarboxylic acid receptor 2
Ligand
BDBM50342524
Substrate
Meas. Tech.
ChEMBL_744661 (CHEMBL1772682)
IC50
1±n/a nM
Citation
 Imbriglio, JEDiRocco, DBodner, RRaghavan, SChen, WMarley, DEsser, CHolt, TGWolff, MSTaggart, AKWaters, MGTata, JRColletti, SL The discovery of high affinity agonists of GPR109a with reduced serum shift and improved ADME properties. Bioorg Med Chem Lett 21:2721-4 (2011)  
Target
Name:
Hydroxycarboxylic acid receptor 2
Synonyms:
G-protein coupled receptor 109A GPR109A HCAR2 HM74A NIACR1 Nicotinic acid receptor 1
Type:
G Protein-Coupled Receptor (GPCR)
Mol. Mass.:
41868.22
Organism:
Homo sapiens (Human)
Description:
Membranes from CHO cells expressing the recombinant human GPR109A were used in competition binding assay.
Residue:
363
  
Inhibitor
Name:
BDBM50342524
Synonyms:
(S)-2-(2-amino-3-(3-(5-hydroxypyridin-2-yl)-1,2,4-oxadiazol-5-yl)propanamido)benzoic acid | CHEMBL1770352
Type:
Small organic molecule
Emp. Form.:
C17H15N5O5
Mol. Mass.:
369.3315
SMILES:
N[C@@H](Cc1nc(no1)-c1ccc(O)cn1)C(=O)Nc1ccccc1C(O)=O
: