Target
Protein-glutamine gamma-glutamyltransferase 2
Ligand
BDBM50342561
Substrate
Meas. Tech.
ChEMBL_744966 (CHEMBL1771981)
Ki
41000±n/a nM
Citation
 Klöck, CJin, XChoi, KKhosla, CMadrid, PBSpencer, ARaimundo, BCBoardman, PLanza, GGriffin, JH Acylideneoxoindoles: a new class of reversible inhibitors of human transglutaminase 2. Bioorg Med Chem Lett 21:2692-6 (2011)  
Target
Name:
Protein-glutamine gamma-glutamyltransferase 2
Synonyms:
Protein-glutamine gamma-glutamyltransferase TGM2 Tissue transglutaminase Transglutaminase 2 (TGM2) Transglutaminase-2
Type:
Protein
Mol. Mass.:
77309.30
Organism:
Homo sapiens (Human)
Description:
P21980
Residue:
687
  
Inhibitor
Name:
BDBM50342561
Synonyms:
(2-oxoindolin-3-ylidene)indolin-2-one CHEMBL515155 | Isoindigo
Type:
Small organic molecule
Emp. Form.:
C16H10N2O2
Mol. Mass.:
262.2628
SMILES:
O=C1Nc2ccccc2\C1=C1/C(=O)Nc2ccccc12
: