Target
Acetylcholinesterase
Ligand
BDBM50342601
Substrate
Meas. Tech.
ChEMBL_744971 (CHEMBL1771986)
IC50
5±n/a nM
Citation
 Al-Rashid, ZFHsung, RP (+)-Arisugacin A--computational evidence of a dual binding site covalent inhibitor of acetylcholinesterase. Bioorg Med Chem Lett 21:2687-91 (2011)  
Target
Name:
Acetylcholinesterase
Synonyms:
ACES_HUMAN Acetylcholinesterase (AChE) | Acetylcholinesterase (human AChE)
Type:
Enzyme
Mol. Mass.:
67792.70
Organism:
Homo sapiens (Human)
Description:
P22303
Residue:
614
  
Inhibitor
Name:
BDBM50342601
Synonyms:
CHEMBL1255901 | Huperzine A
Type:
Small organic molecule
Emp. Form.:
C15H18N2O
Mol. Mass.:
242.3162
SMILES:
C\C=C1/[C@@H]2Cc3[nH]c(=O)ccc3[C@]1(N)CC(C)=C2
: