Target
Cholinesterase
Ligand
BDBM50342602
Substrate
Meas. Tech.
ChEMBL_744974 (CHEMBL1771989)
IC50
8240±n/a nM
Citation
 Bolognesi, MLBartolini, MTarozzi, AMorroni, FLizzi, FMilelli, AMinarini, ARosini, MHrelia, PAndrisano, VMelchiorre, C Multitargeted drugs discovery: balancing anti-amyloid and anticholinesterase capacity in a single chemical entity. Bioorg Med Chem Lett 21:2655-8 (2011)  
Target
Name:
Cholinesterase
Synonyms:
Acylcholine acylhydrolase Butyrylcholine esterase (BChE) Butyrylcholinesterase (BuChE) CHLE_HUMAN Cholinesterases Pseudocholinesterase
Type:
Homotetramer
Mol. Mass.:
68422.27
Organism:
Homo sapiens (Human)
Description:
P06276
Residue:
602
  
Inhibitor
Name:
BDBM50342602
Synonyms:
2,5-bis(3-(4-hydroxy-3-methoxybenzylamino)propylamino)cyclohexa-2,5-diene-1,4-dione | CHEMBL1770548
Type:
Small organic molecule
Emp. Form.:
C28H36N4O6
Mol. Mass.:
524.6086
SMILES:
COc1cc(CNCCCNc2cc(O)c(cc2O)N=CCCNCc2ccc(O)c(OC)c2)ccc1O
: