Target
Acid-sensing ion channel 3
Ligand
BDBM50342645
Substrate
Meas. Tech.
ChEMBL_745055 (CHEMBL1772131)
IC50
19400±n/a nM
Citation
 Wolkenberg, SEZhao, ZMulhearn, JJHarrison, STSanders, JMCato, MJJovanovska, APanigel, JCook, SPHenze, DAKane, SAHartman, GDBarrow, JC High concentration electrophysiology-based fragment screen: discovery of novel acid-sensing ion channel 3 (ASIC3) inhibitors. Bioorg Med Chem Lett 21:2646-9 (2011)  
Target
Name:
Acid-sensing ion channel 3
Synonyms:
ACCN3 ASIC3_HUMAN SLNAC1 | TNAC1
Type:
PROTEIN
Mol. Mass.:
58910.26
Organism:
Homo sapiens (Human)
Description:
ChEMBL_757561
Residue:
531
  
Inhibitor
Name:
BDBM50342645
Synonyms:
6-(2,3-dihydro-1H-pyrrolo[2,3-b]pyridin-5-yl)-1,2,3,4-tetrahydroisoquinoline | CHEMBL1770748
Type:
Small organic molecule
Emp. Form.:
C16H17N3
Mol. Mass.:
251.3263
SMILES:
C1Cc2cc(cnc2N1)-c1ccc2CNCCc2c1
: